{"text_format":"1","workbook":"xlsx","n_sheets":6,"sheets":["Instructions ","Start List Team Scoring","Bib Lists","Placing by Gender","Placing Overall","ScTbl"],"not_rendered":{"charts":0,"images":2,"macros":1,"external_links":0,"defined_names":12,"comments":0,"pivot_tables":0},"unopened":[],"bounds":{"document_bytes":16777216,"sheet_cells":100000,"rows_first":2000,"rows_last":500,"rows_between":2000,"halvings":0,"cell_chars":16384,"cell_head_chars":4096},"cells_cut":0,"cells_raw":0,"read":"whole","date_system":"1900"}

{"sheet":"Instructions ","index":0,"n_rows":42,"n_cols":7,"rows_kept":42,"cut":false,"hidden":false,"merged":[[6,1,6,6],[9,1,9,6],[26,1,26,6],[24,1,24,6],[25,1,25,6],[10,1,10,6],[11,1,11,6],[7,1,7,6],[21,1,21,6],[23,1,23,6],[32,1,32,6],[34,1,34,6],[32,7,32,12],[33,1,33,6],[20,1,20,6],[29,1,29,6],[31,1,31,6],[28,1,28,6],[41,1,41,6],[35,1,35,6],[36,1,36,6],[37,1,37,6],[39,1,39,6],[38,1,38,6],[19,1,19,6],[30,1,30,6],[8,1,8,6],[13,1,13,6],[18,1,18,6],[12,1,12,6],[15,1,15,6],[16,1,16,6],[27,1,27,6]]}
["Adult Masters Race Series Scoring Template Instructions",null,null,null,null,null,"Last updated January 7, 2010"]
["A step-by-step guide to scoring using this template…"]
[]
["DAY BEFORE THE RACE"]
[1,"Have each team submit their start lists by 10am prior to the day of the race using the following format:"]
[null,null,"Individual Start Order (ISO)","First Name Last Name","Age Group","Gender (M/F)","Start Order"]
[2,"To use the \"Create Start List\" and \"Score Race\" buttons to automate these tasks, click on \"Enable Macros\" when prompted.  "]
[3,"Set up teams in the team lookup table in alphabetical order (on the right side in the 'Start List Team Scoring' worksheet).  Assign the start order to the teams in this table (in Column Y) - with the host team starting last.  KEEP TEAM NAMES IN ALPHABETICAL ORDER."]
[{"$f":"A8+1","v":4},"Copy team start lists into the template so that columns match columns in template.  DO NOT ENTER ANY DATA IN THE PALE YELLOW CELLS.  THESE CELLS CONTAIN THE FORMULAS NEEDED TO DO THE SCORING.  Insert the team names using the same acronyms in column H as you used in the team lookup table.  Check that the age categories match the age categories in the age and gender category table.  Edit as req'd.  Check that each team has entered their racer names as firstname lastname (which will help the race announcers), and that they have properly assigned the ISO.  Make necessary corrections."]
[{"$f":"A9+1","v":5},"Press the \"Create Start List\" button at the bottom.  Click \"Yes\" when prompted to do so.  Skip #6 below."]
[null,"- OR -"]
[null,"follow instruction #6"]
[{"$f":"A10+1","v":6},"Sort data in columns B through H for all rows with racers entered in ascending order by column B, then by column D, then by column C to create your start list (with no header row).  This has the effect of assigning appropriate bib numbers to each racer.  DO NOT INCLUDE THE PALE YELLOW CELLS ON THE RIGHT SIDE OF THIS WORKSHEET IN THIS SORT."]
[{"$f":"A13+1","v":7},"Go into the 'Bib Lists' worksheet and sort ALL data in the spreadsheet by team name and bib number (ie by columns H & A) in order to create a bib list for each team.  Reset the page breaks as needed so that each team is printed on a separate page.  Print and use these bib lists when assembling the bibs for each team."]
["RACE DAY MORNING"]
{"$rows_left_out":28}
{"sheet":"Start List Team Scoring","index":1,"n_rows":192,"n_cols":30,"rows_kept":192,"cut":false,"hidden":false,"merged":[[9,26,9,29],[17,22,20,24],[1,0,1,10],[4,14,4,19],[4,8,4,10],[9,22,9,24]]}
[]
["AOS Druxy's Master Race League - HOST TEAM, DATE OF RACE",null,null,null,null,null,null,null,null,null,null,null,null,null,null,null,null,null,"UNOFFICIAL RESULTS"]
["Team and Age Category Placing"]
[]
[null,null,null,null,null,null,null,null,"TIME (secs) or DNS, \nDNF (888), DQ (999)",null,null,null,null,null,"Team Points"]
["BIB#","CSO","TSO","ISO","NAME","AGE GRP","M/F","TEAM","1ST RUN","2ND RUN","BEST RUN","Place","FIN","Points",{"$f":"W12","v":"ALP"},{"$f":"W13","v":"CAL"},{"$f":"W14","v":"CRA"},{"$f":"W15","v":"GP"},{"$f":"W16","v":"TDG"},{"$f":"W17","v":0}]
["FORERUNNERS:",null,null,null,null,null,null,null,null,null,{"$f":"MIN(I7,J6)","v":0},null,null,null,{"$f":"+O182","v":272},386,351,333,227,0]
[null,null,null,null,null,null,null,null,null,null,{"$f":"MIN(I8,J7)","v":0},null,"Note:"]
[null,null,null,null,null,null,null,null,null,null,{"$f":"MIN(I9,J8)","v":0},null,"DNS = DNS,  DNF = 888,  DQ = 999"]
[null,null,null,null,null,null,null,null,null,null,{"$f":"MIN(I10,J9)","v":0},null,null,null,null,null,null,null,null,null,null,null,"Team Set Up",null,null,null,"Age and Gender Categories"]
[null,null,null,null,null,null,null,null,null,null,null,null,null,null,null,null,null,null,null,null,null,null,"Acronym","Team Name","Start Order",null,"Gender","Age Group","Start Order","Starters"]
[1,{"$f":"IF(G12=\"F\",VLOOKUP(F12,$AB$12:$AC$25,2),IF(G12=\"M\",VLOOKUP(F12,$AB$26:$AC$39,2),-1))","v":9},{"$f":"IF(ISERROR(VLOOKUP(H12,$W$12:$Y$17,3,FALSE)),-1,VLOOKUP(H12,$W$12:$Y$17,3,FALSE))","v":3},1,"Margaret-Anne Gold *","65-69","F","TDG","DNS","DNS",{"$f":"MIN(I12,J12)","v":0},{"$f":"IF(B12=B11,IF(K12<>0,L11+1,0),IF(K12<>0,1,0))","v":0},{"$f":"VLOOKUP(B12,AC$12:AD$39,2,FALSE)","v":1},{"$f":"IF(L12>0,HLOOKUP(M12,ScTbl!B$3:Y$27,L12+1,FALSE),0)","v":0},{"$f":"IF($H12=O$6,IF($K12=888,0.01,IF($K12=999,0.01,$N12)),0)","v":0},0,0,0,0,0,null,null,"ALP","ALPINE",2,null,"F","18-29",23,{"$f":"SUM(IF(B$11:B$168=AC12,IF(K$11:K$168>0,1,0),0))","v":6}]
[2,{"$f":"IF(G13=\"F\",VLOOKUP(F13,$AB$12:$AC$25,2),IF(G13=\"M\",VLOOKUP(F13,$AB$26:$AC$39,2),-1))","v":9},{"$f":"IF(ISERROR(VLOOKUP(H13,$W$12:$Y$17,3,FALSE)),-1,VLOOKUP(H13,$W$12:$Y$17,3,FALSE))","v":3},2,"Patricia Bain","65-69","F","TDG",48.24,"DNS",{"$f":"MIN(I13,J13)","v":48.24},1,{"$f":"VLOOKUP(B13,AC$12:AD$39,2,FALSE)","v":1},{"$f":"IF(L13>0,HLOOKUP(M13,ScTbl!B$3:Y$27,L13+1,FALSE),0)","v":21},0,0,0,0,21,0,null,null,"CAL","CALEDON",5,null,"F","30-34",22,{"$f":"SUM(IF(B$11:B$168=AC13,IF(K$11:K$168>0,1,0),0))","v":1}]
[3,{"$f":"IF(G14=\"F\",VLOOKUP(F14,$AB$12:$AC$25,2),IF(G14=\"M\",VLOOKUP(F14,$AB$26:$AC$39,2),-1))","v":10},{"$f":"IF(ISERROR(VLOOKUP(H14,$W$12:$Y$17,3,FALSE)),-1,VLOOKUP(H14,$W$12:$Y$17,3,FALSE))","v":4},1,"Jane Willson","60-64","F","GP",39.03,39.29,{"$f":"MIN(I14,J14)","v":39.03},1,2,{"$f":"IF(L14>0,HLOOKUP(M14,ScTbl!B$3:Y$27,L14+1,FALSE),0)","v":22},0,0,0,22,0,0,null,null,"CRA","CRAIGLEITH",1,null,"F","35-39",21,{"$f":"SUM(IF(B$11:B$168=AC14,IF(K$11:K$168>0,1,0),0))","v":0}]
[4,{"$f":"IF(G15=\"F\",VLOOKUP(F15,$AB$12:$AC$25,2),IF(G15=\"M\",VLOOKUP(F15,$AB$26:$AC$39,2),-1))","v":10},{"$f":"IF(ISERROR(VLOOKUP(H15,$W$12:$Y$17,3,FALSE)),-1,VLOOKUP(H15,$W$12:$Y$17,3,FALSE))","v":5},1,"Sharon Regan","60-64","F","CAL",39.53,40.729999999999997,{"$f":"MIN(I15,J15)","v":39.53},2,2,{"$f":"IF(L15>0,HLOOKUP(M15,ScTbl!B$3:Y$27,L15+1,FALSE),0)","v":21},0,21,0,0,0,0,null,null,"GP","GEORGIAN PEAKS",4,null,"F","40-44",18,{"$f":"SUM(IF(B$11:B$168=AC15,IF(K$11:K$168>0,1,0),0))","v":0}]
{"$rows_left_out":178}
{"sheet":"Bib Lists","index":2,"n_rows":162,"n_cols":8,"rows_kept":162,"cut":false,"hidden":false,"merged":[[1,0,1,7]]}
[]
[{"$f":"'Start List Team Scoring'!A2:K2","v":"AOS Druxy's Master Race League - HOST TEAM, DATE OF RACE"}]
["Start Lists - Sorted per Team"]
[]
[]
["BIB#","CSO","TSO","ISO","NAME","AGE","M/F","TEAM"]
[{"$f":"'Start List Team Scoring'!A12","v":1},{"$f":"'Start List Team Scoring'!B12","v":9},{"$f":"'Start List Team Scoring'!C12","v":3},{"$f":"'Start List Team Scoring'!D12","v":1},{"$f":"'Start List Team Scoring'!E12","v":"Margaret-Anne Gold *"},{"$f":"'Start List Team Scoring'!F12","v":"65-69"},{"$f":"'Start List Team Scoring'!G12","v":"F"},{"$f":"'Start List Team Scoring'!H12","v":"TDG"}]
[{"$f":"'Start List Team Scoring'!A13","v":2},{"$f":"'Start List Team Scoring'!B13","v":9},{"$f":"'Start List Team Scoring'!C13","v":3},{"$f":"'Start List Team Scoring'!D13","v":2},{"$f":"'Start List Team Scoring'!E13","v":"Patricia Bain"},{"$f":"'Start List Team Scoring'!F13","v":"65-69"},{"$f":"'Start List Team Scoring'!G13","v":"F"},{"$f":"'Start List Team Scoring'!H13","v":"TDG"}]
[{"$f":"'Start List Team Scoring'!A14","v":3},{"$f":"'Start List Team Scoring'!B14","v":10},{"$f":"'Start List Team Scoring'!C14","v":4},{"$f":"'Start List Team Scoring'!D14","v":1},{"$f":"'Start List Team Scoring'!E14","v":"Jane Willson"},{"$f":"'Start List Team Scoring'!F14","v":"60-64"},{"$f":"'Start List Team Scoring'!G14","v":"F"},{"$f":"'Start List Team Scoring'!H14","v":"GP"}]
[{"$f":"'Start List Team Scoring'!A15","v":4},{"$f":"'Start List Team Scoring'!B15","v":10},{"$f":"'Start List Team Scoring'!C15","v":5},{"$f":"'Start List Team Scoring'!D15","v":1},{"$f":"'Start List Team Scoring'!E15","v":"Sharon Regan"},{"$f":"'Start List Team Scoring'!F15","v":"60-64"},{"$f":"'Start List Team Scoring'!G15","v":"F"},{"$f":"'Start List Team Scoring'!H15","v":"CAL"}]
[{"$f":"'Start List Team Scoring'!A16","v":5},{"$f":"'Start List Team Scoring'!B16","v":11},{"$f":"'Start List Team Scoring'!C16","v":2},{"$f":"'Start List Team Scoring'!D16","v":1},{"$f":"'Start List Team Scoring'!E16","v":"Ken Lackner"},{"$f":"'Start List Team Scoring'!F16","v":"75-79"},{"$f":"'Start List Team Scoring'!G16","v":"M"},{"$f":"'Start List Team Scoring'!H16","v":"ALP"}]
[{"$f":"'Start List Team Scoring'!A17","v":8},{"$f":"'Start List Team Scoring'!B17","v":11},{"$f":"'Start List Team Scoring'!C17","v":4},{"$f":"'Start List Team Scoring'!D17","v":3},{"$f":"'Start List Team Scoring'!E17","v":"Geoff Lowe"},{"$f":"'Start List Team Scoring'!F17","v":"75-79"},{"$f":"'Start List Team Scoring'!G17","v":"M"},{"$f":"'Start List Team Scoring'!H17","v":"GP"}]
[{"$f":"'Start List Team Scoring'!A18","v":6},{"$f":"'Start List Team Scoring'!B18","v":11},{"$f":"'Start List Team Scoring'!C18","v":4},{"$f":"'Start List Team Scoring'!D18","v":1},{"$f":"'Start List Team Scoring'!E18","v":"Gene Kinoshita"},{"$f":"'Start List Team Scoring'!F18","v":"75-79"},{"$f":"'Start List Team Scoring'!G18","v":"M"},{"$f":"'Start List Team Scoring'!H18","v":"GP"}]
[{"$f":"'Start List Team Scoring'!A19","v":7},{"$f":"'Start List Team Scoring'!B19","v":11},{"$f":"'Start List Team Scoring'!C19","v":4},{"$f":"'Start List Team Scoring'!D19","v":2},{"$f":"'Start List Team Scoring'!E19","v":"John Hethrington"},{"$f":"'Start List Team Scoring'!F19","v":"75-79"},{"$f":"'Start List Team Scoring'!G19","v":"M"},{"$f":"'Start List Team Scoring'!H19","v":"GP"}]
[{"$f":"'Start List Team Scoring'!A20","v":13},{"$f":"'Start List Team Scoring'!B20","v":12},{"$f":"'Start List Team Scoring'!C20","v":4},{"$f":"'Start List Team Scoring'!D20","v":2},{"$f":"'Start List Team Scoring'!E20","v":"Gerry Young"},{"$f":"'Start List Team Scoring'!F20","v":"70-74"},{"$f":"'Start List Team Scoring'!G20","v":"M"},{"$f":"'Start List Team Scoring'!H20","v":"GP"}]
{"$rows_left_out":148}
{"sheet":"Placing by Gender","index":3,"n_rows":162,"n_cols":9,"rows_kept":162,"cut":false,"hidden":false,"merged":[[3,5,3,7]]}
[{"$f":"'Start List Team Scoring'!A2","v":"AOS Druxy's Master Race League - HOST TEAM, DATE OF RACE"}]
["Individual Placing by Gender"]
["(sort by M/F then Best Run)"]
[null,null,null,null,null,"TIME (seconds) or DNS, DNF, DQ"]
["BIB#","NAME","AGE","M/F","TEAM","1ST RUN","2ND RUN","BEST RUN","Place"]
[]
[{"$f":"'Start List Team Scoring'!A12","v":1},{"$f":"'Start List Team Scoring'!E12","v":"Margaret-Anne Gold *"},{"$f":"'Start List Team Scoring'!F12","v":"65-69"},{"$f":"'Start List Team Scoring'!G12","v":"F"},{"$f":"'Start List Team Scoring'!H12","v":"TDG"},{"$f":"'Start List Team Scoring'!I12","v":"DNS"},{"$f":"'Start List Team Scoring'!J12","v":"DNS"},{"$f":"'Start List Team Scoring'!K12","v":0},{"$f":"IF(D7=D6,IF(H7<>0,IF(I6=\"\",1,I6+1),\"\"),IF(H7<>0,1,\"\"))","v":""}]
[{"$f":"'Start List Team Scoring'!A13","v":2},{"$f":"'Start List Team Scoring'!E13","v":"Patricia Bain"},{"$f":"'Start List Team Scoring'!F13","v":"65-69"},{"$f":"'Start List Team Scoring'!G13","v":"F"},{"$f":"'Start List Team Scoring'!H13","v":"TDG"},{"$f":"'Start List Team Scoring'!I13","v":48.24},{"$f":"'Start List Team Scoring'!J13","v":"DNS"},{"$f":"'Start List Team Scoring'!K13","v":48.24},1]
[{"$f":"'Start List Team Scoring'!A14","v":3},{"$f":"'Start List Team Scoring'!E14","v":"Jane Willson"},{"$f":"'Start List Team Scoring'!F14","v":"60-64"},{"$f":"'Start List Team Scoring'!G14","v":"F"},{"$f":"'Start List Team Scoring'!H14","v":"GP"},{"$f":"'Start List Team Scoring'!I14","v":39.03},{"$f":"'Start List Team Scoring'!J14","v":39.29},{"$f":"'Start List Team Scoring'!K14","v":39.03},2]
[{"$f":"'Start List Team Scoring'!A15","v":4},{"$f":"'Start List Team Scoring'!E15","v":"Sharon Regan"},{"$f":"'Start List Team Scoring'!F15","v":"60-64"},{"$f":"'Start List Team Scoring'!G15","v":"F"},{"$f":"'Start List Team Scoring'!H15","v":"CAL"},{"$f":"'Start List Team Scoring'!I15","v":39.53},{"$f":"'Start List Team Scoring'!J15","v":40.729999999999997},{"$f":"'Start List Team Scoring'!K15","v":39.53},3]
[{"$f":"'Start List Team Scoring'!A16","v":5},{"$f":"'Start List Team Scoring'!E16","v":"Ken Lackner"},{"$f":"'Start List Team Scoring'!F16","v":"75-79"},{"$f":"'Start List Team Scoring'!G16","v":"M"},{"$f":"'Start List Team Scoring'!H16","v":"ALP"},{"$f":"'Start List Team Scoring'!I16","v":37.61},{"$f":"'Start List Team Scoring'!J16","v":"DNS"},{"$f":"'Start List Team Scoring'!K16","v":37.61},1]
[{"$f":"'Start List Team Scoring'!A17","v":8},{"$f":"'Start List Team Scoring'!E17","v":"Geoff Lowe"},{"$f":"'Start List Team Scoring'!F17","v":"75-79"},{"$f":"'Start List Team Scoring'!G17","v":"M"},{"$f":"'Start List Team Scoring'!H17","v":"GP"},{"$f":"'Start List Team Scoring'!I17","v":38.01},{"$f":"'Start List Team Scoring'!J17","v":888},{"$f":"'Start List Team Scoring'!K17","v":38.01},2]
[{"$f":"'Start List Team Scoring'!A18","v":6},{"$f":"'Start List Team Scoring'!E18","v":"Gene Kinoshita"},{"$f":"'Start List Team Scoring'!F18","v":"75-79"},{"$f":"'Start List Team Scoring'!G18","v":"M"},{"$f":"'Start List Team Scoring'!H18","v":"GP"},{"$f":"'Start List Team Scoring'!I18","v":38.479999999999997},{"$f":"'Start List Team Scoring'!J18","v":888},{"$f":"'Start List Team Scoring'!K18","v":38.479999999999997},3]
[{"$f":"'Start List Team Scoring'!A19","v":7},{"$f":"'Start List Team Scoring'!E19","v":"John Hethrington"},{"$f":"'Start List Team Scoring'!F19","v":"75-79"},{"$f":"'Start List Team Scoring'!G19","v":"M"},{"$f":"'Start List Team Scoring'!H19","v":"GP"},{"$f":"'Start List Team Scoring'!I19","v":70.040000000000006},{"$f":"'Start List Team Scoring'!J19","v":"DNS"},{"$f":"'Start List Team Scoring'!K19","v":70.040000000000006},4]
[{"$f":"'Start List Team Scoring'!A20","v":13},{"$f":"'Start List Team Scoring'!E20","v":"Gerry Young"},{"$f":"'Start List Team Scoring'!F20","v":"70-74"},{"$f":"'Start List Team Scoring'!G20","v":"M"},{"$f":"'Start List Team Scoring'!H20","v":"GP"},{"$f":"'Start List Team Scoring'!I20","v":"DNS"},{"$f":"'Start List Team Scoring'!J20","v":"DNS"},{"$f":"'Start List Team Scoring'!K20","v":0},""]
{"$rows_left_out":148}
{"sheet":"Placing Overall","index":4,"n_rows":162,"n_cols":9,"rows_kept":162,"cut":false,"hidden":false,"merged":[[3,5,3,7]]}
[{"$f":"'Start List Team Scoring'!A2","v":"AOS Druxy's Master Race League - HOST TEAM, DATE OF RACE"}]
["Individual Placing Overall"]
["(sort by Best Run)"]
[null,null,null,null,null,"TIME (seconds) or DNS, DNF, DQ"]
["BIB#","NAME","AGE","M/F","TEAM","1ST RUN","2ND RUN","BEST RUN","Place"]
[]
[{"$f":"'Start List Team Scoring'!A12","v":1},{"$f":"'Start List Team Scoring'!E12","v":"Margaret-Anne Gold *"},{"$f":"'Start List Team Scoring'!F12","v":"65-69"},{"$f":"'Start List Team Scoring'!G12","v":"F"},{"$f":"'Start List Team Scoring'!H12","v":"TDG"},{"$f":"'Start List Team Scoring'!I12","v":"DNS"},{"$f":"'Start List Team Scoring'!J12","v":"DNS"},{"$f":"'Start List Team Scoring'!K12","v":0},{"$f":"IF(H7<>0,IF(I6=\"\",1,I6+1),\"\")","v":""}]
[{"$f":"'Start List Team Scoring'!A25","v":16},{"$f":"'Start List Team Scoring'!E25","v":"Brenda Tweel"},{"$f":"'Start List Team Scoring'!F25","v":"55-59"},{"$f":"'Start List Team Scoring'!G25","v":"F"},{"$f":"'Start List Team Scoring'!H25","v":"CAL"},{"$f":"'Start List Team Scoring'!I25","v":"DNS"},{"$f":"'Start List Team Scoring'!J25","v":"DNS"},{"$f":"'Start List Team Scoring'!K25","v":0},{"$f":"IF(H8<>0,IF(I7=\"\",1,I7+1),\"\")","v":""}]
[{"$f":"'Start List Team Scoring'!A26","v":17},{"$f":"'Start List Team Scoring'!E26","v":"Mary Ferguson"},{"$f":"'Start List Team Scoring'!F26","v":"55-59"},{"$f":"'Start List Team Scoring'!G26","v":"F"},{"$f":"'Start List Team Scoring'!H26","v":"TDG"},{"$f":"'Start List Team Scoring'!I26","v":"DNS"},{"$f":"'Start List Team Scoring'!J26","v":"DNS"},{"$f":"'Start List Team Scoring'!K26","v":0},{"$f":"IF(H9<>0,IF(I8=\"\",1,I8+1),\"\")","v":""}]
[{"$f":"'Start List Team Scoring'!A29","v":20},{"$f":"'Start List Team Scoring'!E29","v":"Patricia Butler"},{"$f":"'Start List Team Scoring'!F29","v":"50-54"},{"$f":"'Start List Team Scoring'!G29","v":"F"},{"$f":"'Start List Team Scoring'!H29","v":"TDG"},{"$f":"'Start List Team Scoring'!I29","v":"DNS"},{"$f":"'Start List Team Scoring'!J29","v":"DNS"},{"$f":"'Start List Team Scoring'!K29","v":0},{"$f":"IF(H10<>0,IF(I9=\"\",1,I9+1),\"\")","v":""}]
[{"$f":"'Start List Team Scoring'!A30","v":23},{"$f":"'Start List Team Scoring'!E30","v":"Tiana Boyman"},{"$f":"'Start List Team Scoring'!F30","v":"50-54"},{"$f":"'Start List Team Scoring'!G30","v":"F"},{"$f":"'Start List Team Scoring'!H30","v":"CRA"},{"$f":"'Start List Team Scoring'!I30","v":"DNS"},{"$f":"'Start List Team Scoring'!J30","v":"DNS"},{"$f":"'Start List Team Scoring'!K30","v":0},{"$f":"IF(H11<>0,IF(I10=\"\",1,I10+1),\"\")","v":""}]
[{"$f":"'Start List Team Scoring'!A45","v":34},{"$f":"'Start List Team Scoring'!E45","v":"Barbara Fydell"},{"$f":"'Start List Team Scoring'!F45","v":"45-49"},{"$f":"'Start List Team Scoring'!G45","v":"F"},{"$f":"'Start List Team Scoring'!H45","v":"TDG"},{"$f":"'Start List Team Scoring'!I45","v":"DNS"},{"$f":"'Start List Team Scoring'!J45","v":"DNS"},{"$f":"'Start List Team Scoring'!K45","v":0},{"$f":"IF(H12<>0,IF(I11=\"\",1,I11+1),\"\")","v":""}]
[{"$f":"'Start List Team Scoring'!A76","v":65},{"$f":"'Start List Team Scoring'!E76","v":"Alana Cox"},{"$f":"'Start List Team Scoring'!F76","v":"35-39"},{"$f":"'Start List Team Scoring'!G76","v":"F"},{"$f":"'Start List Team Scoring'!H76","v":"ALP"},{"$f":"'Start List Team Scoring'!I76","v":"DNS"},{"$f":"'Start List Team Scoring'!J76","v":"DNS"},{"$f":"'Start List Team Scoring'!K76","v":0},{"$f":"IF(H13<>0,IF(I12=\"\",1,I12+1),\"\")","v":""}]
[{"$f":"'Start List Team Scoring'!A78","v":72},{"$f":"'Start List Team Scoring'!E78","v":"Stephanie Clark"},{"$f":"'Start List Team Scoring'!F78","v":"18-29"},{"$f":"'Start List Team Scoring'!G78","v":"F"},{"$f":"'Start List Team Scoring'!H78","v":"CRA"},{"$f":"'Start List Team Scoring'!I78","v":"DNS"},{"$f":"'Start List Team Scoring'!J78","v":"DNS"},{"$f":"'Start List Team Scoring'!K78","v":0},{"$f":"IF(H14<>0,IF(I13=\"\",1,I13+1),\"\")","v":""}]
[{"$f":"'Start List Team Scoring'!A79","v":71},{"$f":"'Start List Team Scoring'!E79","v":"Emily Shiletto"},{"$f":"'Start List Team Scoring'!F79","v":"18-29"},{"$f":"'Start List Team Scoring'!G79","v":"F"},{"$f":"'Start List Team Scoring'!H79","v":"CAL"},{"$f":"'Start List Team Scoring'!I79","v":24.26},{"$f":"'Start List Team Scoring'!J79","v":24.63},{"$f":"'Start List Team Scoring'!K79","v":24.26},{"$f":"IF(H15<>0,IF(I14=\"\",1,I14+1),\"\")","v":1}]
{"$rows_left_out":148}
{"sheet":"ScTbl","index":5,"n_rows":28,"n_cols":27,"rows_kept":28,"cut":false,"hidden":false,"merged":[[1,1,1,24]]}
["SCORING TABLE"]
[null,"# of Racers",null,null,null,null,null,null,null,null,null,null,null,null,null,null,null,null,null,null,null,null,null,null,null,null,{"$f":"HLOOKUP(2,B3:Y27,2,FALSE)","v":22}]
["Place",24,23,22,21,20,19,18,17,16,15,14,13,12,11,10,9,8,7,6,5,4,3,2,1]
[1,33,32,32,31,31,30,30,29,29,28,28,27,27,26,26,25,25,24,24,23,23,22,22,21]
[2,32,31,31,30,{"$f":"+F4-1","v":30},29,29,28,28,27,27,26,26,25,25,24,24,23,23,22,22,21,{"$f":"+X4-1","v":21}]
[3,31,30,30,29,{"$f":"+F5-1","v":29},{"$f":"+G5-1","v":28},{"$f":"+H5-1","v":28},{"$f":"+I5-1","v":27},{"$f":"+J5-1","v":27},{"$f":"+K5-1","v":26},{"$f":"+L5-1","v":26},{"$f":"+M5-1","v":25},{"$f":"+N5-1","v":25},{"$f":"+O5-1","v":24},{"$f":"+P5-1","v":24},23,23,22,22,21,21,20]
[4,30,29,29,28,28,27,27,26,26,25,25,24,24,23,{"$f":"+P6-1","v":23},22,22,21,21,20,20]
[5,29,28,28,27,27,26,26,25,25,24,24,23,23,22,{"$f":"+P7-1","v":22},21,21,20,20,19]
[6,28,27,27,26,26,25,25,24,24,23,23,22,22,21,{"$f":"+P8-1","v":21},{"$f":"+Q8-1","v":20},{"$f":"+R8-1","v":20},{"$f":"+S8-1","v":19},{"$f":"+T8-1","v":19}]
[7,27,26,26,25,25,24,24,23,23,22,22,21,21,20,{"$f":"+P9-1","v":20},{"$f":"+Q9-1","v":19},{"$f":"+R9-1","v":19},{"$f":"+S9-1","v":18}]
[8,26,25,25,24,24,23,23,22,22,21,21,20,20,19,{"$f":"+P10-1","v":19},{"$f":"+Q10-1","v":18},{"$f":"+R10-1","v":18}]
[9,25,24,24,23,23,22,22,21,21,20,20,19,19,18,{"$f":"+P11-1","v":18},{"$f":"+Q11-1","v":17}]
[10,24,23,23,22,22,21,21,20,20,19,19,18,18,17,{"$f":"+P12-1","v":17}]
[11,23,22,22,21,21,20,20,19,19,18,18,17,17,16]
[12,22,21,21,20,20,19,19,18,18,17,17,16,16]
{"$rows_left_out":13}